Target
Mitochondrial import inner membrane translocase subunit TIM23
Ligand
BDBM76435
Substrate
Meas. Tech.
Dose Response confirmation of uHTS small molecule inhibitors of tim10-1: a luminescent tim23-1 yeast counterscreen.
IC50
15700±n/a nM
Citation
 PubChem, PC Dose Response confirmation of uHTS small molecule inhibitors of tim10-1: a luminescent tim23-1 yeast counterscreen. PubChem Bioassay (2011)[AID] 
Target
Name:
Mitochondrial import inner membrane translocase subunit TIM23
Synonyms:
MAS6 MPI3 TIM23_YEAST | TPA: Essential component of the Translocase of the Inner Mitochondrial membrane (TIM23 complex)
Type:
Enzyme Catalytic Domain
Mol. Mass.:
23245.32
Organism:
Saccharomyces cerevisiae S288c
Description:
gi_285814664
Residue:
222
  
Inhibitor
Name:
BDBM76435
Synonyms:
1-[(Z)-3-indolylidenemethyl]-2-(2-nitrophenyl)hydrazine 1-[(Z)-indol-3-ylidenemethyl]-2-(2-nitrophenyl)hydrazine N-(1H-Indol-3-ylmethylene)-N'-(2-nitro-phenyl)-hydrazine cid_5332521
Type:
Small organic molecule
Emp. Form.:
C15H12N4O2
Mol. Mass.:
280.2814
SMILES:
[O-][N+](=O)c1ccccc1N=[NH+]Cc1c[n-]c2ccccc12
: