Target
Mitochondrial import inner membrane translocase subunit TIM23
Ligand
BDBM50154
Substrate
Meas. Tech.
Dose Response confirmation of uHTS small molecule inhibitors of tim10-1: a luminescent tim23-1 yeast counterscreen.
IC50
5550±n/a nM
Citation
 PubChem, PC Dose Response confirmation of uHTS small molecule inhibitors of tim10-1: a luminescent tim23-1 yeast counterscreen. PubChem Bioassay (2011)[AID] 
Target
Name:
Mitochondrial import inner membrane translocase subunit TIM23
Synonyms:
MAS6 MPI3 TIM23_YEAST | TPA: Essential component of the Translocase of the Inner Mitochondrial membrane (TIM23 complex)
Type:
Enzyme Catalytic Domain
Mol. Mass.:
23245.32
Organism:
Saccharomyces cerevisiae S288c
Description:
gi_285814664
Residue:
222
  
Inhibitor
Name:
BDBM50154
Synonyms:
(3Z)-3-(1H-indol-3-ylmethylene)chroman-2,4-quinone (3Z)-3-(1H-indol-3-ylmethylidene)chromene-2,4-dione MLS000553382 cid_5291977
Type:
Small organic molecule
Emp. Form.:
C18H11NO3
Mol. Mass.:
289.2848
SMILES:
O=C1Oc2ccccc2C(=O)\C1=C\c1c[nH]c2ccccc12
: