Target
Mitochondrial import inner membrane translocase subunit TIM23
Ligand
BDBM78322
Substrate
Meas. Tech.
Dose Response confirmation of uHTS small molecule inhibitors of tim10-1: a luminescent tim23-1 yeast counterscreen.
IC50
13800±n/a nM
Citation
 PubChem, PC Dose Response confirmation of uHTS small molecule inhibitors of tim10-1: a luminescent tim23-1 yeast counterscreen. PubChem Bioassay (2011)[AID] 
Target
Name:
Mitochondrial import inner membrane translocase subunit TIM23
Synonyms:
MAS6 MPI3 TIM23_YEAST | TPA: Essential component of the Translocase of the Inner Mitochondrial membrane (TIM23 complex)
Type:
Enzyme Catalytic Domain
Mol. Mass.:
23245.32
Organism:
Saccharomyces cerevisiae S288c
Description:
gi_285814664
Residue:
222
  
Inhibitor
Name:
BDBM78322
Synonyms:
1-(4-acetylphenyl)-3-[1-(2,4-dichlorophenyl)ethyl]thiourea MLS000772498 cid_4969038
Type:
Small organic molecule
Emp. Form.:
C17H16Cl2N2OS
Mol. Mass.:
367.293
SMILES:
CC(NC(=S)Nc1ccc(cc1)C(C)=O)c1ccc(Cl)cc1Cl
: