Target
Mitochondrial import inner membrane translocase subunit TIM23
Ligand
BDBM78383
Substrate
Meas. Tech.
Dose Response confirmation of uHTS small molecule inhibitors of tim10-1: a luminescent tim23-1 yeast counterscreen.
IC50
12100±n/a nM
Citation
 PubChem, PC Dose Response confirmation of uHTS small molecule inhibitors of tim10-1: a luminescent tim23-1 yeast counterscreen. PubChem Bioassay (2011)[AID] 
Target
Name:
Mitochondrial import inner membrane translocase subunit TIM23
Synonyms:
MAS6 MPI3 TIM23_YEAST | TPA: Essential component of the Translocase of the Inner Mitochondrial membrane (TIM23 complex)
Type:
Enzyme Catalytic Domain
Mol. Mass.:
23245.32
Organism:
Saccharomyces cerevisiae S288c
Description:
gi_285814664
Residue:
222
  
Inhibitor
Name:
BDBM78383
Synonyms:
2-chloro-N'-[(3,4-dimethoxybenzoyl)oxy]benzenecarboximidamide 3,4-dimethoxybenzoic acid [(Z)-[amino-(2-chlorophenyl)methylidene]amino] ester SMR000556107 [(Z)-[azanyl-(2-chlorophenyl)methylidene]amino] 3,4-dimethoxybenzoate | cid_9567028
Type:
Small organic molecule
Emp. Form.:
C16H15ClN2O4
Mol. Mass.:
334.754
SMILES:
COc1ccc(cc1OC)C(=O)ON=C(N)c1ccccc1Cl
: