Target
Neurotensin receptor type 1
Ligand
BDBM79520
Substrate
Meas. Tech.
Dose Response confirmation of Image-Based HTS for Selective Agonists for NTR1
EC50
31100±n/a nM
Citation
 PubChem, PC Dose Response confirmation of Image-Based HTS for Selective Agonists for NTR1 PubChem Bioassay (2011)[AID] 
Target
Name:
Neurotensin receptor type 1
Synonyms:
Dopamine receptor D2L/neurotensin receptor NTS1 NTRR Neurotensin receptor 1 | neurotensin receptor type 1
Type:
PROTEIN
Mol. Mass.:
46278.89
Organism:
Homo sapiens (Human)
Description:
ChEMBL_1453811
Residue:
418
  
Inhibitor
Name:
BDBM79520
Synonyms:
MLS000087794 N-[2-(2-fluorophenyl)-1,3-benzoxazol-5-yl]-2,3-dihydro-1,4-benzodioxine-6-carboxamide cid_3237758
Type:
Small organic molecule
Emp. Form.:
C22H15FN2O4
Mol. Mass.:
390.3639
SMILES:
Fc1ccccc1-c1nc2cc(NC(=O)c3ccc4OCCOc4c3)ccc2o1
: