Target
Neurotensin receptor type 1
Ligand
BDBM52323
Substrate
Meas. Tech.
Dose Response confirmation of Image-Based HTS for Selective Agonists for NTR1
EC50
7150±n/a nM
Citation
 PubChem, PC Dose Response confirmation of Image-Based HTS for Selective Agonists for NTR1 PubChem Bioassay (2011)[AID] 
Target
Name:
Neurotensin receptor type 1
Synonyms:
Dopamine receptor D2L/neurotensin receptor NTS1 NTRR Neurotensin receptor 1 | neurotensin receptor type 1
Type:
PROTEIN
Mol. Mass.:
46278.89
Organism:
Homo sapiens (Human)
Description:
ChEMBL_1453811
Residue:
418
  
Inhibitor
Name:
BDBM52323
Synonyms:
2-[4-keto-3-[2-keto-2-(tetrahydrofurfurylamino)ethyl]-5-[(6-methoxy-2-naphthyl)methylene]thiazolidin-2-ylidene]acetic acid ethyl ester MLS000567764 cid_4875908 ethyl 2-[5-[(6-methoxynaphthalen-2-yl)methylidene]-4-oxo-3-[2-oxo-2-(oxolan-2-ylmethylamino)ethyl]-1,3-thiazolidin-2-ylidene]acetate
Type:
Small organic molecule
Emp. Form.:
C26H28N2O6S
Mol. Mass.:
496.575
SMILES:
CCOC(=O)C=c1sc(=Cc2ccc3cc(OC)ccc3c2)c(=O)n1CC(=O)NCC1CCCO1
: