Target
Neurotensin receptor type 1
Ligand
BDBM79534
Substrate
Meas. Tech.
Dose Response confirmation of Image-Based HTS for Selective Agonists for NTR1
EC50
35300±n/a nM
Citation
 PubChem, PC Dose Response confirmation of Image-Based HTS for Selective Agonists for NTR1 PubChem Bioassay (2011)[AID] 
Target
Name:
Neurotensin receptor type 1
Synonyms:
Dopamine receptor D2L/neurotensin receptor NTS1 NTRR Neurotensin receptor 1 | neurotensin receptor type 1
Type:
PROTEIN
Mol. Mass.:
46278.89
Organism:
Homo sapiens (Human)
Description:
ChEMBL_1453811
Residue:
418
  
Inhibitor
Name:
BDBM79534
Synonyms:
2-[[3-(4-chlorophenyl)-1-phenyl-4-pyrazolyl]methylidene]-5,5-dimethylcyclohexane-1,3-dione 2-[[3-(4-chlorophenyl)-1-phenyl-pyrazol-4-yl]methylidene]-5,5-dimethyl-cyclohexane-1,3-dione 2-{[3-(4-chlorophenyl)-1-phenyl-1H-pyrazol-4-yl]methylene}-5,5-dimethyl-1,3-cyclohexanedione SMR000194522 | cid_1345509
Type:
Small organic molecule
Emp. Form.:
C24H21ClN2O2
Mol. Mass.:
404.889
SMILES:
[#6]C1([#6])[#6]-[#6](=O)\[#6](=[#6]/c2cn(nc2-c2ccc(Cl)cc2)-c2ccccc2)-[#6](=O)-[#6]1
: