Target
Neurotensin receptor type 1
Ligand
BDBM79536
Substrate
Meas. Tech.
Dose Response confirmation of Image-Based HTS for Selective Agonists for NTR1
EC50
19600±n/a nM
Citation
 PubChem, PC Dose Response confirmation of Image-Based HTS for Selective Agonists for NTR1 PubChem Bioassay (2011)[AID] 
Target
Name:
Neurotensin receptor type 1
Synonyms:
Dopamine receptor D2L/neurotensin receptor NTS1 NTRR Neurotensin receptor 1 | neurotensin receptor type 1
Type:
PROTEIN
Mol. Mass.:
46278.89
Organism:
Homo sapiens (Human)
Description:
ChEMBL_1453811
Residue:
418
  
Inhibitor
Name:
BDBM79536
Synonyms:
2-[(5-Bromo-thiophen-2-yl)-(2-hydroxy-4,4-dimethyl-6-oxo-cyclohex-1-enyl)-methyl]-5,5-dimethyl-cyclohexane-1,3-dione 2-[(5-bromo-2-thienyl)-(2-hydroxy-6-keto-4,4-dimethyl-cyclohexen-1-yl)methyl]-5,5-dimethyl-cyclohexane-1,3-quinone 2-[(5-bromothiophen-2-yl)-(2-hydroxy-4,4-dimethyl-6-oxocyclohexen-1-yl)methyl]-5,5-dimethylcyclohexane-1,3-dione SMR000175563 | cid_2832800
Type:
Small organic molecule
Emp. Form.:
C21H25BrO4S
Mol. Mass.:
453.39
SMILES:
CC1(C)CC(=O)C(C(C2C(=O)CC(C)(C)CC2=O)c2ccc(Br)s2)C(=O)C1
: