Target
Neurotensin receptor type 1
Ligand
BDBM63210
Substrate
Meas. Tech.
Dose Response confirmation of Image-Based HTS for Selective Agonists for NTR1
EC50
5830±n/a nM
Citation
 PubChem, PC Dose Response confirmation of Image-Based HTS for Selective Agonists for NTR1 PubChem Bioassay (2011)[AID] 
Target
Name:
Neurotensin receptor type 1
Synonyms:
Dopamine receptor D2L/neurotensin receptor NTS1 NTRR Neurotensin receptor 1 | neurotensin receptor type 1
Type:
PROTEIN
Mol. Mass.:
46278.89
Organism:
Homo sapiens (Human)
Description:
ChEMBL_1453811
Residue:
418
  
Inhibitor
Name:
BDBM63210
Synonyms:
3-({7-[(4-methylphenyl)thio]-4-nitro-2,1,3-benzoxadiazol-5-yl}amino)propyl acetate 3-[[7-(4-methylphenyl)sulfanyl-4-nitro-2,1,3-benzoxadiazol-5-yl]amino]propyl ethanoate SMR000207041 acetic acid 3-[[7-[(4-methylphenyl)thio]-4-nitro-2,1,3-benzoxadiazol-5-yl]amino]propyl ester | cid_12005285
Type:
Small organic molecule
Emp. Form.:
C18H18N4O5S
Mol. Mass.:
402.424
SMILES:
CC(=O)OCCCNc1cc(Sc2ccc(C)cc2)c2nonc2c1[N+]([O-])=O
: