Target
Neurotensin receptor type 1
Ligand
BDBM79558
Substrate
Meas. Tech.
Dose Response confirmation of Image-Based HTS for Selective Agonists for NTR1
EC50
13900±n/a nM
Citation
 PubChem, PC Dose Response confirmation of Image-Based HTS for Selective Agonists for NTR1 PubChem Bioassay (2011)[AID] 
Target
Name:
Neurotensin receptor type 1
Synonyms:
Dopamine receptor D2L/neurotensin receptor NTS1 NTRR Neurotensin receptor 1 | neurotensin receptor type 1
Type:
PROTEIN
Mol. Mass.:
46278.89
Organism:
Homo sapiens (Human)
Description:
ChEMBL_1453811
Residue:
418
  
Inhibitor
Name:
BDBM79558
Synonyms:
(4Z)-4-(4-benzoxy-3-ethoxy-benzylidene)-3-methyl-2-isoxazolin-5-one (4Z)-4-[(3-ethoxy-4-phenylmethoxyphenyl)methylidene]-3-methyl-1,2-oxazol-5-one 4-[4-(benzyloxy)-3-ethoxybenzylidene]-3-methyl-5(4H)-isoxazolone SMR000225854 | cid_745143
Type:
Small organic molecule
Emp. Form.:
C20H19NO4
Mol. Mass.:
337.3692
SMILES:
CCOc1cc(\C=C2/C(=O)ON=C2C)ccc1OCc1ccccc1
: