Target
Neurotensin receptor type 1
Ligand
BDBM79560
Substrate
Meas. Tech.
Dose Response confirmation of Image-Based HTS for Selective Agonists for NTR1
EC50
19000±n/a nM
Citation
 PubChem, PC Dose Response confirmation of Image-Based HTS for Selective Agonists for NTR1 PubChem Bioassay (2011)[AID] 
Target
Name:
Neurotensin receptor type 1
Synonyms:
Dopamine receptor D2L/neurotensin receptor NTS1 NTRR Neurotensin receptor 1 | neurotensin receptor type 1
Type:
PROTEIN
Mol. Mass.:
46278.89
Organism:
Homo sapiens (Human)
Description:
ChEMBL_1453811
Residue:
418
  
Inhibitor
Name:
BDBM79560
Synonyms:
(5E)-5-[(E)-3-(2-furanyl)prop-2-enylidene]-1-(4-propan-2-ylphenyl)-1,3-diazinane-2,4,6-trione (5E)-5-[(E)-3-(furan-2-yl)prop-2-enylidene]-1-(4-propan-2-ylphenyl)-1,3-diazinane-2,4,6-trione 5-[(E)-3-Furan-2-yl-prop-2-en-(E)-ylidene]-1-(4-isopropyl-phenyl)-pyrimidine-2,4,6-trione SMR000211311 | cid_1922630
Type:
Small organic molecule
Emp. Form.:
C20H18N2O4
Mol. Mass.:
350.3679
SMILES:
CC(C)c1ccc(cc1)N1C(=O)NC(=O)C(=CC=Cc2ccco2)C1=O
: