Target
Neurotensin receptor type 1
Ligand
BDBM51331
Substrate
Meas. Tech.
Dose Response confirmation of Image-Based HTS for Selective Agonists for NTR1
EC50
9390±n/a nM
Citation
 PubChem, PC Dose Response confirmation of Image-Based HTS for Selective Agonists for NTR1 PubChem Bioassay (2011)[AID] 
Target
Name:
Neurotensin receptor type 1
Synonyms:
Dopamine receptor D2L/neurotensin receptor NTS1 NTRR Neurotensin receptor 1 | neurotensin receptor type 1
Type:
PROTEIN
Mol. Mass.:
46278.89
Organism:
Homo sapiens (Human)
Description:
ChEMBL_1453811
Residue:
418
  
Inhibitor
Name:
BDBM51331
Synonyms:
(E)-3-(2,3-dimethoxyphenyl)-1-(3-nitrophenyl)-2-propen-1-one MLS000684566 cid_5346304
Type:
Small organic molecule
Emp. Form.:
C17H15NO5
Mol. Mass.:
313.3047
SMILES:
COc1cccc(\C=C\C(=O)c2cccc(c2)[N+]([O-])=O)c1OC
: