Target
Neurotensin receptor type 1
Ligand
BDBM79563
Substrate
Meas. Tech.
Dose Response confirmation of Image-Based HTS for Selective Agonists for NTR1
EC50
7590±n/a nM
Citation
 PubChem, PC Dose Response confirmation of Image-Based HTS for Selective Agonists for NTR1 PubChem Bioassay (2011)[AID] 
Target
Name:
Neurotensin receptor type 1
Synonyms:
Dopamine receptor D2L/neurotensin receptor NTS1 NTRR Neurotensin receptor 1 | neurotensin receptor type 1
Type:
PROTEIN
Mol. Mass.:
46278.89
Organism:
Homo sapiens (Human)
Description:
ChEMBL_1453811
Residue:
418
  
Inhibitor
Name:
BDBM79563
Synonyms:
4-methyl-N-[5-(phenylcarbamothioylamino)-1,3,4-thiadiazol-2-yl]benzamide MLS000390029 SMR000259293 | cid_1547875
Type:
Small organic molecule
Emp. Form.:
C17H15N5OS2
Mol. Mass.:
369.464
SMILES:
Cc1ccc(cc1)C(=O)Nc1nnc(NC(=S)Nc2ccccc2)s1
: