Target
Neurotensin receptor type 1
Ligand
BDBM71095
Substrate
Meas. Tech.
Dose Response confirmation of Image-Based HTS for Selective Agonists for NTR1
EC50
9290±n/a nM
Citation
 PubChem, PC Dose Response confirmation of Image-Based HTS for Selective Agonists for NTR1 PubChem Bioassay (2011)[AID] 
Target
Name:
Neurotensin receptor type 1
Synonyms:
Dopamine receptor D2L/neurotensin receptor NTS1 NTRR Neurotensin receptor 1 | neurotensin receptor type 1
Type:
PROTEIN
Mol. Mass.:
46278.89
Organism:
Homo sapiens (Human)
Description:
ChEMBL_1453811
Residue:
418
  
Inhibitor
Name:
BDBM71095
Synonyms:
4-mesyl-3-nitro-benzoic acid [2-keto-2-[(1-methyl-3-phenyl-propyl)amino]ethyl] ester MLS001003365 [2-oxidanylidene-2-(4-phenylbutan-2-ylamino)ethyl] 4-methylsulfonyl-3-nitro-benzoate cid_3350604
Type:
Small organic molecule
Emp. Form.:
C20H22N2O7S
Mol. Mass.:
434.463
SMILES:
CC(CCc1ccccc1)NC(=O)COC(=O)c1ccc(c(c1)[N+]([O-])=O)S(C)(=O)=O
: