Target
Neurotensin receptor type 1
Ligand
BDBM60722
Substrate
Meas. Tech.
Dose Response confirmation of Image-Based HTS for Selective Agonists for NTR1
EC50
2710±n/a nM
Citation
 PubChem, PC Dose Response confirmation of Image-Based HTS for Selective Agonists for NTR1 PubChem Bioassay (2011)[AID] 
Target
Name:
Neurotensin receptor type 1
Synonyms:
Dopamine receptor D2L/neurotensin receptor NTS1 NTRR Neurotensin receptor 1 | neurotensin receptor type 1
Type:
PROTEIN
Mol. Mass.:
46278.89
Organism:
Homo sapiens (Human)
Description:
ChEMBL_1453811
Residue:
418
  
Inhibitor
Name:
BDBM60722
Synonyms:
5,7-dihydroxy-2-(4-hydroxyphenyl)-6-(3,4,5-trihydroxy-6-methylol-tetrahydropyran-2-yl)chromone 5,7-dihydroxy-2-(4-hydroxyphenyl)-6-[3,4,5-trihydroxy-6-(hydroxymethyl)oxan-2-yl]chromen-4-one MLS000877022 cid_4475102
Type:
Small organic molecule
Emp. Form.:
C21H20O10
Mol. Mass.:
432.3775
SMILES:
OCC1OC(C(O)C(O)C1O)c1c(O)cc2oc(cc(=O)c2c1O)-c1ccc(O)cc1
: