Target
Neurotensin receptor type 1
Ligand
BDBM58167
Substrate
Meas. Tech.
Dose Response confirmation of Image-Based HTS for Selective Agonists for NTR1
EC50
5400±n/a nM
Citation
 PubChem, PC Dose Response confirmation of Image-Based HTS for Selective Agonists for NTR1 PubChem Bioassay (2011)[AID] 
Target
Name:
Neurotensin receptor type 1
Synonyms:
Dopamine receptor D2L/neurotensin receptor NTS1 NTRR Neurotensin receptor 1 | neurotensin receptor type 1
Type:
PROTEIN
Mol. Mass.:
46278.89
Organism:
Homo sapiens (Human)
Description:
ChEMBL_1453811
Residue:
418
  
Inhibitor
Name:
BDBM58167
Synonyms:
(2S)-4-methyl-2-[[4-[[(1S)-1-phenylethyl]carbamoyl]-1H-imidazole-5-carbonyl]amino]valeric acid benzyl ester (phenylmethyl) (2S)-4-methyl-2-[[4-[[(1S)-1-phenylethyl]carbamoyl]-1H-imidazol-5-yl]carbonylamino]pentanoate SMR000391236 cid_16745378
Type:
Small organic molecule
Emp. Form.:
C26H30N4O4
Mol. Mass.:
462.5408
SMILES:
CC(C)C[C@H](NC(=O)c1[nH]cnc1C(=O)N[C@@H](C)c1ccccc1)C(=O)OCc1ccccc1
: