Target
Neurotensin receptor type 1
Ligand
BDBM60842
Substrate
Meas. Tech.
Dose Response confirmation of Image-Based HTS for Selective Agonists for NTR1
EC50
12100±n/a nM
Citation
 PubChem, PC Dose Response confirmation of Image-Based HTS for Selective Agonists for NTR1 PubChem Bioassay (2011)[AID] 
Target
Name:
Neurotensin receptor type 1
Synonyms:
Dopamine receptor D2L/neurotensin receptor NTS1 NTRR Neurotensin receptor 1 | neurotensin receptor type 1
Type:
PROTEIN
Mol. Mass.:
46278.89
Organism:
Homo sapiens (Human)
Description:
ChEMBL_1453811
Residue:
418
  
Inhibitor
Name:
BDBM60842
Synonyms:
3-(4-chlorophenyl)-4-(4-hydroxy-3-methoxybenzylidene)-5(4H)-isoxazolone 3-(4-chlorophenyl)-4-[(E)-(3-methoxy-4-oxo-1-cyclohexa-2,5-dienylidene)methyl]-2H-isoxazol-5-one 3-(4-chlorophenyl)-4-[(E)-(4-keto-3-methoxy-cyclohexa-2,5-dien-1-ylidene)methyl]-3-isoxazolin-5-one SMR000476132 | cid_5337349
Type:
Small organic molecule
Emp. Form.:
C17H12ClNO4
Mol. Mass.:
329.734
SMILES:
COC1=CC(=Cc2c([nH]oc2=O)-c2ccc(Cl)cc2)C=CC1=O
: