Target
Neurotensin receptor type 1
Ligand
BDBM66731
Substrate
Meas. Tech.
Dose Response confirmation of Image-Based HTS for Selective Agonists for NTR1
EC50
26000±n/a nM
Citation
 PubChem, PC Dose Response confirmation of Image-Based HTS for Selective Agonists for NTR1 PubChem Bioassay (2011)[AID] 
Target
Name:
Neurotensin receptor type 1
Synonyms:
Dopamine receptor D2L/neurotensin receptor NTS1 NTRR Neurotensin receptor 1 | neurotensin receptor type 1
Type:
PROTEIN
Mol. Mass.:
46278.89
Organism:
Homo sapiens (Human)
Description:
ChEMBL_1453811
Residue:
418
  
Inhibitor
Name:
BDBM66731
Synonyms:
1-Methyl-3-nitro-4-p-tolylsulfanyl-1H-quinolin-2-one 1-methyl-4-(4-methylphenyl)sulfanyl-3-nitro-quinolin-2-one 1-methyl-4-[(4-methylphenyl)thio]-3-nitro-2-quinolinone SMR000515954 | cid_776319
Type:
Small organic molecule
Emp. Form.:
C17H14N2O3S
Mol. Mass.:
326.37
SMILES:
Cc1ccc(Sc2c([N+]([O-])=O)c(=O)n(C)c3ccccc23)cc1
: