Target
Neurotensin receptor type 1
Ligand
BDBM79586
Substrate
Meas. Tech.
Dose Response confirmation of Image-Based HTS for Selective Agonists for NTR1
EC50
16000±n/a nM
Citation
 PubChem, PC Dose Response confirmation of Image-Based HTS for Selective Agonists for NTR1 PubChem Bioassay (2011)[AID] 
Target
Name:
Neurotensin receptor type 1
Synonyms:
Dopamine receptor D2L/neurotensin receptor NTS1 NTRR Neurotensin receptor 1 | neurotensin receptor type 1
Type:
PROTEIN
Mol. Mass.:
46278.89
Organism:
Homo sapiens (Human)
Description:
ChEMBL_1453811
Residue:
418
  
Inhibitor
Name:
BDBM79586
Synonyms:
4-[(4E)-4-({5-[4-chloro-3-(ethoxycarbonyl)phenyl]-2-furyl}methylene)-3-methyl-5-oxo-4,5-dihydro-1H-pyrazol-1-yl]benzoic acid 4-[(4E)-4-[[5-(4-chloranyl-3-ethoxycarbonyl-phenyl)furan-2-yl]methylidene]-3-methyl-5-oxidanylidene-pyrazol-1-yl]benzoic acid 4-[(4E)-4-[[5-(4-chloro-3-ethoxycarbonylphenyl)furan-2-yl]methylidene]-3-methyl-5-oxopyrazol-1-yl]benzoic acid SMR000555956 | cid_1270554
Type:
Small organic molecule
Emp. Form.:
C25H19ClN2O6
Mol. Mass.:
478.881
SMILES:
CCOC(=O)c1cc(ccc1Cl)-c1ccc(C=c2c(=C)[nH]n(-c3ccc(cc3)C(O)=O)c2=O)o1
: