Target
Integrin alpha-L
Ligand
BDBM79612
Substrate
Meas. Tech.
Dose Response of Developing T Cell Immune Modulators with powder sourced compounds
EC50
26±n/a nM
Citation
 PubChem, PC Dose Response of Developing T Cell Immune Modulators with powder sourced compounds PubChem Bioassay (2011)[AID] 
Target
Name:
Integrin alpha-L
Synonyms:
CD11 antigen-like family member A Itgal Leukocyte function-associated molecule 1 alpha chain Ly-15 | Lymphocyte antigen 15
Type:
Enzyme Catalytic Domain
Mol. Mass.:
128317.79
Organism:
Mus musculus
Description:
P24063
Residue:
1163
  
Inhibitor
Name:
BDBM79612
Synonyms:
VU0424152-1 [2-[[2-chloranyl-5-(diethylsulfamoyl)phenyl]amino]-2-oxidanylidene-ethyl] cyclohexanecarboxylate cyclohexanecarboxylic acid [2-[2-chloro-5-(diethylsulfamoyl)anilino]-2-keto-ethyl] ester | cyclohexanecarboxylic acid [2-[2-chloro-5-(diethylsulfamoyl)anilino]-2-oxoethyl] ester
Type:
Small organic molecule
Emp. Form.:
C19H27ClN2O5S
Mol. Mass.:
430.946
SMILES:
CCN(CC)S(=O)(=O)c1ccc(Cl)c(NC(=O)COC(=O)C2CCCCC2)c1
: