Target
Short transient receptor potential channel 4
Ligand
BDBM79624
Substrate
Meas. Tech.
SAR Analysis for the identification of selective inhibits of the transient receptor potential cation channel C4 (TRPC4): Automated Electrophysiology_2
IC50
3940±n/a nM
Citation
 PubChem, PC SAR Analysis for the identification of selective inhibits of the transient receptor potential cation channel C4 (TRPC4): Automated Electrophysiology_2 PubChem Bioassay (2011)[AID] 
Target
Name:
Short transient receptor potential channel 4
Synonyms:
TRPC4_MOUSE Trrp4 | alternatively spliced Trp4
Type:
Enzyme Catalytic Domain
Mol. Mass.:
111587.67
Organism:
Mus musculus
Description:
Q9QUQ5
Residue:
974
  
Inhibitor
Name:
BDBM79624
Synonyms:
6-fluoranyl-4-methyl-2-pyrrolidin-1-yl-quinoline;2,2,2-tris(fluoranyl)ethanoic acid 6-fluoro-4-methyl-2-pyrrolidin-1-ylquinoline;2,2,2-trifluoroacetic acid VU0419902-1 | cid_46891904
Type:
Small organic molecule
Emp. Form.:
C14H15FN2
Mol. Mass.:
230.2807
SMILES:
Cc1cc(nc2ccc(F)cc12)N1CCCC1
: