Target
BRCA1-associated RING domain protein 1
Ligand
BDBM43474
Substrate
Meas. Tech.
Dose Response confirmation of Inhibitors of Mdm2/MdmX interaction using a Brca1/Bard1 BiLC Counterscreen assay
IC50
9780±n/a nM
Citation
 PubChem, PC Dose Response confirmation of Inhibitors of Mdm2/MdmX interaction using a Brca1/Bard1 BiLC Counterscreen assay PubChem Bioassay (2011)[AID] 
Target
Name:
BRCA1-associated RING domain protein 1
Synonyms:
BARD-1 BARD1_HUMAN
Type:
Enzyme Catalytic Domain
Mol. Mass.:
86678.08
Organism:
Homo sapiens (Human)
Description:
gi_116241265
Residue:
777
  
Inhibitor
Name:
BDBM43474
Synonyms:
(3Z,5E)-1-ethyl-3,5-bis(3-hydroxy-4-methoxy-benzylidene)-4-piperidone (3Z,5E)-1-ethyl-3,5-bis[(3-hydroxy-4-methoxyphenyl)methylidene]piperidin-4-one MLS000775870 cid_2376815
Type:
Small organic molecule
Emp. Form.:
C23H25NO5
Mol. Mass.:
395.4483
SMILES:
CCN1C\C(=C\c2ccc(OC)c(O)c2)C(=O)\C(C1)=C\c1ccc(OC)c(O)c1
: