Target
Mitochondrial import inner membrane translocase subunit TIM10
Ligand
BDBM77627
Substrate
Meas. Tech.
Dose Response confirmation of uHTS small molecule inhibitors of tim23-1: a luminescent TIM10 yeast counterscreen.
IC50
17000±n/a nM
Citation
 PubChem, PC Dose Response confirmation of uHTS small molecule inhibitors of tim23-1: a luminescent TIM10 yeast counterscreen. PubChem Bioassay (2011)[AID] 
Target
Name:
Mitochondrial import inner membrane translocase subunit TIM10
Synonyms:
MRS11 TIM10_YEAST TPA: Essential protein of the mitochondrial intermembrane space, forms a complex with Tim9p (TIM10 complex) that delivers hydrophobic proteins to the TIM22 complex for insertion into the inner ...
Type:
Enzyme Catalytic Domain
Mol. Mass.:
10303.50
Organism:
Saccharomyces cerevisiae S288c
Description:
gi_285809906
Residue:
93
  
Inhibitor
Name:
BDBM77627
Synonyms:
4-Chloro-3-(5-ethyl-benzooxazol-2-yl)-phenylamine 4-chloro-3-(5-ethyl-1,3-benzoxazol-2-yl)aniline SMR000013963 cid_644550
Type:
Small organic molecule
Emp. Form.:
C15H13ClN2O
Mol. Mass.:
272.73
SMILES:
CCc1ccc2oc(nc2c1)-c1cc(N)ccc1Cl
: