Target
Mitochondrial import inner membrane translocase subunit TIM10
Ligand
BDBM38880
Substrate
Meas. Tech.
Dose Response confirmation of uHTS small molecule inhibitors of tim23-1: a luminescent TIM10 yeast counterscreen.
IC50
20500±n/a nM
Citation
 PubChem, PC Dose Response confirmation of uHTS small molecule inhibitors of tim23-1: a luminescent TIM10 yeast counterscreen. PubChem Bioassay (2011)[AID] 
Target
Name:
Mitochondrial import inner membrane translocase subunit TIM10
Synonyms:
MRS11 TIM10_YEAST TPA: Essential protein of the mitochondrial intermembrane space, forms a complex with Tim9p (TIM10 complex) that delivers hydrophobic proteins to the TIM22 complex for insertion into the inner ...
Type:
Enzyme Catalytic Domain
Mol. Mass.:
10303.50
Organism:
Saccharomyces cerevisiae S288c
Description:
gi_285809906
Residue:
93
  
Inhibitor
Name:
BDBM38880
Synonyms:
6-methoxy-2-phenyl-imidazo[2,1-b][1,3]benzothiazole MLS000078899 cid_657882
Type:
Small organic molecule
Emp. Form.:
C16H12N2OS
Mol. Mass.:
280.344
SMILES:
COc1ccc2c(c1)sc1nc(cn21)-c1ccccc1
: