Target
Mitochondrial import inner membrane translocase subunit TIM10
Ligand
BDBM77651
Substrate
Meas. Tech.
Dose Response confirmation of uHTS small molecule inhibitors of tim23-1: a luminescent TIM10 yeast counterscreen.
IC50
19900±n/a nM
Citation
 PubChem, PC Dose Response confirmation of uHTS small molecule inhibitors of tim23-1: a luminescent TIM10 yeast counterscreen. PubChem Bioassay (2011)[AID] 
Target
Name:
Mitochondrial import inner membrane translocase subunit TIM10
Synonyms:
MRS11 TIM10_YEAST TPA: Essential protein of the mitochondrial intermembrane space, forms a complex with Tim9p (TIM10 complex) that delivers hydrophobic proteins to the TIM22 complex for insertion into the inner ...
Type:
Enzyme Catalytic Domain
Mol. Mass.:
10303.50
Organism:
Saccharomyces cerevisiae S288c
Description:
gi_285809906
Residue:
93
  
Inhibitor
Name:
BDBM77651
Synonyms:
2-methyl-5-[2,2,2-trifluoro-1,1-bis(trifluoromethyl)ethyl]-1H-benzimidazole 6-[1,1,1,3,3,3-hexafluoro-2-(trifluoromethyl)propan-2-yl]-2-methyl-1H-benzimidazole MLS000099165 cid_2277404
Type:
Small organic molecule
Emp. Form.:
C12H7F9N2
Mol. Mass.:
350.183
SMILES:
Cc1nc2ccc(cc2[nH]1)C(C(F)(F)F)(C(F)(F)F)C(F)(F)F
: