Target
Bcl-2-related protein A1
Ligand
BDBM51857
Substrate
Meas. Tech.
Dose Response confirmation of UBC13 Polyubiquitin Inhibitors using a Bfl-1 counterscreen
IC50
13100±203 nM
Citation
 PubChem, PC Dose Response confirmation of UBC13 Polyubiquitin Inhibitors using a Bfl-1 counterscreen PubChem Bioassay (2011)[AID] 
Target
Name:
Bcl-2-related protein A1
Synonyms:
A1 B-cell leukemia/lymphoma 2 related protein A1a Bcl2a1 Bfl-1 Hemopoietic-specific early response protein | Protein BFL-1
Type:
Apoptosis regulator protein
Mol. Mass.:
19909.74
Organism:
Mus musculus (Mouse)
Description:
gi_11024684
Residue:
172
  
Inhibitor
Name:
BDBM51857
Synonyms:
MLS001010894 N-[4-(3-bromophenyl)-1,3-thiazol-2-yl]-2-[3-[3-(dimethylamino)propyl]-4-oxoquinazolin-2-yl]sulfanylacetamide N-[4-(3-bromophenyl)thiazol-2-yl]-2-[[3-[3-(dimethylamino)propyl]-4-keto-quinazolin-2-yl]thio]acetamide cid_2080746
Type:
Small organic molecule
Emp. Form.:
C24H24BrN5O2S2
Mol. Mass.:
558.514
SMILES:
CN(C)CCCn1c(SCC(=O)Nc2nc(cs2)-c2cccc(Br)c2)nc2ccccc2c1=O
: