Target
Bcl-2-related protein A1
Ligand
BDBM55930
Substrate
Meas. Tech.
Dose Response confirmation of UBC13 Polyubiquitin Inhibitors using a Bfl-1 counterscreen
IC50
8760±327 nM
Citation
 PubChem, PC Dose Response confirmation of UBC13 Polyubiquitin Inhibitors using a Bfl-1 counterscreen PubChem Bioassay (2011)[AID] 
Target
Name:
Bcl-2-related protein A1
Synonyms:
A1 B-cell leukemia/lymphoma 2 related protein A1a Bcl2a1 Bfl-1 Hemopoietic-specific early response protein | Protein BFL-1
Type:
Apoptosis regulator protein
Mol. Mass.:
19909.74
Organism:
Mus musculus (Mouse)
Description:
gi_11024684
Residue:
172
  
Inhibitor
Name:
BDBM55930
Synonyms:
5-(4-cyanophenyl)-N-[3-[[4-[(4-ethyl-1-piperazinyl)methyl]-3-(trifluoromethyl)anilino]-oxomethyl]-5-methoxyphenyl]-3-pyridinecarboxamide 5-(4-cyanophenyl)-N-[3-[[4-[(4-ethylpiperazin-1-yl)methyl]-3-(trifluoromethyl)phenyl]carbamoyl]-5-methoxyphenyl]pyridine-3-carboxamide 5-(4-cyanophenyl)-N-[3-[[4-[(4-ethylpiperazino)methyl]-3-(trifluoromethyl)phenyl]carbamoyl]-5-methoxy-phenyl]nicotinamide;2,2,2-trifluoroacetic acid SMR000463590 | cid_16746136
Type:
Small organic molecule
Emp. Form.:
C35H33F3N6O3
Mol. Mass.:
642.6701
SMILES:
CCN1CCN(Cc2ccc(NC(=O)c3cc(NC(=O)c4cncc(c4)-c4ccc(cc4)C#N)cc(OC)c3)cc2C(F)(F)F)CC1
: