Target
Bcl-2-related protein A1
Ligand
BDBM67655
Substrate
Meas. Tech.
Dose Response confirmation of UBC13 Polyubiquitin Inhibitors using a Bfl-1 counterscreen
IC50
10100±238 nM
Citation
 PubChem, PC Dose Response confirmation of UBC13 Polyubiquitin Inhibitors using a Bfl-1 counterscreen PubChem Bioassay (2011)[AID] 
Target
Name:
Bcl-2-related protein A1
Synonyms:
A1 B-cell leukemia/lymphoma 2 related protein A1a Bcl2a1 Bfl-1 Hemopoietic-specific early response protein | Protein BFL-1
Type:
Apoptosis regulator protein
Mol. Mass.:
19909.74
Organism:
Mus musculus (Mouse)
Description:
gi_11024684
Residue:
172
  
Inhibitor
Name:
BDBM67655
Synonyms:
2-[2-[(4-chlorophenoxy)methyl]-3-methyl-1-benzimidazol-3-iumyl]acetic acid decyl ester;chloride MLS001163988 cid_24747653 decyl 2-[2-[(4-chlorophenoxy)methyl]-3-methylbenzimidazol-3-ium-1-yl]acetate;chloride
Type:
Small organic molecule
Emp. Form.:
C27H36ClN2O3
Mol. Mass.:
472.039
SMILES:
CCCCCCCCCCOC(=O)Cn1c(COc2ccc(Cl)cc2)[n+](C)c2ccccc12
: