Target
Bcl-2-related protein A1
Ligand
BDBM78433
Substrate
Meas. Tech.
Dose Response confirmation of UBC13 Polyubiquitin Inhibitors using a Bfl-1 counterscreen
IC50
>20000±0 nM
Citation
 PubChem, PC Dose Response confirmation of UBC13 Polyubiquitin Inhibitors using a Bfl-1 counterscreen PubChem Bioassay (2011)[AID] 
Target
Name:
Bcl-2-related protein A1
Synonyms:
A1 B-cell leukemia/lymphoma 2 related protein A1a Bcl2a1 Bfl-1 Hemopoietic-specific early response protein | Protein BFL-1
Type:
Apoptosis regulator protein
Mol. Mass.:
19909.74
Organism:
Mus musculus (Mouse)
Description:
gi_11024684
Residue:
172
  
Inhibitor
Name:
BDBM78433
Synonyms:
2-[4-[3-[2-(trifluoromethyl)-10-phenothiazinyl]propyl]-1-piperazinyl]ethanol;hydrochloride 2-[4-[3-[2-(trifluoromethyl)phenothiazin-10-yl]propyl]piperazino]ethanol;hydrochloride FLUPHENAZINE HYDROCHLORIDE SMR000058411 cid_6602611 | med.21724, Compound 17
Type:
Small organic molecule
Emp. Form.:
C22H26F3N3OS
Mol. Mass.:
437.522
SMILES:
OCCN1CCN(CCCN2c3ccccc3Sc3ccc(cc23)C(F)(F)F)CC1
: