Target
Bcl-2-related protein A1
Ligand
BDBM59083
Substrate
Meas. Tech.
Dose Response confirmation of UBC13 Polyubiquitin Inhibitors using a Bfl-1 counterscreen
IC50
6440±134 nM
Citation
 PubChem, PC Dose Response confirmation of UBC13 Polyubiquitin Inhibitors using a Bfl-1 counterscreen PubChem Bioassay (2011)[AID] 
Target
Name:
Bcl-2-related protein A1
Synonyms:
A1 B-cell leukemia/lymphoma 2 related protein A1a Bcl2a1 Bfl-1 Hemopoietic-specific early response protein | Protein BFL-1
Type:
Apoptosis regulator protein
Mol. Mass.:
19909.74
Organism:
Mus musculus (Mouse)
Description:
gi_11024684
Residue:
172
  
Inhibitor
Name:
BDBM59083
Synonyms:
MLS002154065 THONZONIUM BROMIDE cid_11102
Type:
Small organic molecule
Emp. Form.:
C32H55N4O
Mol. Mass.:
511.8048
SMILES:
CCCCCCCCCCCCCCCC[N+](C)(C)CCN(Cc1ccc(OC)cc1)c1ncccn1
: