Target
Tropomyosin alpha-1 chain
Ligand
BDBM50897
Substrate
Meas. Tech.
Fluorescence-based biochemical high throughput dose response assay for activators of the calcium sensitivity of cardiac Regulated Thin Filaments (RTF)
EC50
286.87±n/a nM
Citation
 PubChem, PC Fluorescence-based biochemical high throughput dose response assay for activators of the calcium sensitivity of cardiac Regulated Thin Filaments (RTF) PubChem Bioassay (2011)[AID] 
Target
Name:
Tropomyosin alpha-1 chain
Synonyms:
TPM1 cardiac alpha tropomyosin
Type:
Enzyme Catalytic Domain
Mol. Mass.:
32681.01
Organism:
Sus scrofa
Description:
P42639
Residue:
284
  
Inhibitor
Name:
BDBM50897
Synonyms:
(5Z)-3-isobutyl-5-[[2-(3-isopropoxypropylamino)-4-keto-9-methyl-pyrido[1,2-a]pyrimidin-3-yl]methylene]-2-thioxo-thiazolidin-4-one (5Z)-5-[[9-methyl-4-oxo-2-(3-propan-2-yloxypropylamino)-3-pyrido[1,2-a]pyrimidinyl]methylidene]-3-(2-methylpropyl)-2-sulfanylidene-4-thiazolidinone 3-[3-Isobutyl-4-oxo-2-thioxo-thiazolidin-(5Z)-ylidenemethyl]-2-(3-isopropoxy-propylamino)-9-methyl-pyri do[1,2-a]pyrimidin-4-one SMR000148018 | cid_1885415
Type:
Small organic molecule
Emp. Form.:
C23H30N4O3S2
Mol. Mass.:
474.639
SMILES:
CC(C)CN1C(=S)S\C(=C/c2c(NCCCOC(C)C)nc3c(C)cccn3c2=O)C1=O
: