Target
Tropomyosin alpha-1 chain
Ligand
BDBM79724
Substrate
Meas. Tech.
Fluorescence-based biochemical high throughput dose response assay for activators of the calcium sensitivity of cardiac Regulated Thin Filaments (RTF)
EC50
>71485±n/a nM
Citation
 PubChem, PC Fluorescence-based biochemical high throughput dose response assay for activators of the calcium sensitivity of cardiac Regulated Thin Filaments (RTF) PubChem Bioassay (2011)[AID] 
Target
Name:
Tropomyosin alpha-1 chain
Synonyms:
TPM1 cardiac alpha tropomyosin
Type:
Enzyme Catalytic Domain
Mol. Mass.:
32681.01
Organism:
Sus scrofa
Description:
P42639
Residue:
284
  
Inhibitor
Name:
BDBM79724
Synonyms:
(4Z)-4-(dimethylaminomethylene)-5-keto-2-methyl-2-pyrroline-3-carboxylic acid methyl ester MLS000763756 cid_5525182 methyl (4Z)-4-(dimethylaminomethylidene)-2-methyl-5-oxo-1H-pyrrole-3-carboxylate | methyl 4-[(dimethylamino)methylene]-2-methyl-5-oxo-4,5-dihydro-1H-pyrrole-3-carboxylate
Type:
Small organic molecule
Emp. Form.:
C10H14N2O3
Mol. Mass.:
210.2298
SMILES:
COC(=O)C1=C(C)NC(=O)\C1=C/N(C)C
: