Target
Orexin/Hypocretin receptor type 1
Ligand
BDBM34288
Substrate
Meas. Tech.
Fluorescence-based cell-based high throughput dose response assay for antagonists of the orexin 1 receptor (OX1R; HCRTR1)
IC50
1410±n/a nM
Citation
 PubChem, PC Fluorescence-based cell-based high throughput dose response assay for antagonists of the orexin 1 receptor (OX1R; HCRTR1) PubChem Bioassay (2011)[AID] 
Target
Name:
Orexin/Hypocretin receptor type 1
Synonyms:
HCRTR1 OX1R_HUMAN Orexin receptor type 1 (OR 1) Orexin receptor type 1 (OX1) Orexin receptor type 1 (OxR1) | Ox1r
Type:
Protein
Mol. Mass.:
47554.50
Organism:
Homo sapiens (Human)
Description:
O43613
Residue:
425
  
Inhibitor
Name:
BDBM34288
Synonyms:
2-[(4-amino-3-methyl-2-thioxo-4-thiazoline-5-carbonyl)amino]benzoic acid methyl ester MLS000083486 cid_665848 methyl 2-[(4-azanyl-3-methyl-2-sulfanylidene-1,3-thiazol-5-yl)carbonylamino]benzoate
Type:
Small organic molecule
Emp. Form.:
C13H13N3O3S2
Mol. Mass.:
323.391
SMILES:
COC(=O)c1ccccc1NC(=O)c1sc(=S)n(C)c1N
: