Target
Orexin/Hypocretin receptor type 1
Ligand
BDBM52289
Substrate
Meas. Tech.
Fluorescence-based cell-based high throughput dose response assay for antagonists of the orexin 1 receptor (OX1R; HCRTR1)
IC50
525.84±n/a nM
Citation
 PubChem, PC Fluorescence-based cell-based high throughput dose response assay for antagonists of the orexin 1 receptor (OX1R; HCRTR1) PubChem Bioassay (2011)[AID] 
Target
Name:
Orexin/Hypocretin receptor type 1
Synonyms:
HCRTR1 OX1R_HUMAN Orexin receptor type 1 (OR 1) Orexin receptor type 1 (OX1) Orexin receptor type 1 (OxR1) | Ox1r
Type:
Protein
Mol. Mass.:
47554.50
Organism:
Homo sapiens (Human)
Description:
O43613
Residue:
425
  
Inhibitor
Name:
BDBM52289
Synonyms:
5-(2,4-dimethoxybenzylidene)-2-(2-methoxyphenyl)thiazolo[3,2-b][1,2,4]triazol-6-one 5-[(2,4-dimethoxyphenyl)methylidene]-2-(2-methoxyphenyl)-[1,3]thiazolo[3,2-b][1,2,4]triazol-6-one MLS000557551 cid_3719021
Type:
Small organic molecule
Emp. Form.:
C20H17N3O4S
Mol. Mass.:
395.432
SMILES:
COc1ccc(C=c2sc3nc(nn3c2=O)-c2ccccc2OC)c(OC)c1
: