Target
Orexin/Hypocretin receptor type 1
Ligand
BDBM79921
Substrate
Meas. Tech.
Fluorescence-based cell-based high throughput dose response assay for antagonists of the orexin 1 receptor (OX1R; HCRTR1)
IC50
2366±n/a nM
Citation
 PubChem, PC Fluorescence-based cell-based high throughput dose response assay for antagonists of the orexin 1 receptor (OX1R; HCRTR1) PubChem Bioassay (2011)[AID] 
Target
Name:
Orexin/Hypocretin receptor type 1
Synonyms:
HCRTR1 OX1R_HUMAN Orexin receptor type 1 (OR 1) Orexin receptor type 1 (OX1) Orexin receptor type 1 (OxR1) | Ox1r
Type:
Protein
Mol. Mass.:
47554.50
Organism:
Homo sapiens (Human)
Description:
O43613
Residue:
425
  
Inhibitor
Name:
BDBM79921
Synonyms:
1H-indol-2-yl-(4-tosyl-1,4-diazepan-1-yl)methanone MLS001172054 cid_9397654
Type:
Small organic molecule
Emp. Form.:
C21H23N3O3S
Mol. Mass.:
397.491
SMILES:
Cc1ccc(cc1)S(=O)(=O)N1CCCN(CC1)C(=O)c1cc2ccccc2[nH]1
: