Target
Orexin/Hypocretin receptor type 1
Ligand
BDBM79926
Substrate
Meas. Tech.
Fluorescence-based cell-based high throughput dose response assay for antagonists of the orexin 1 receptor (OX1R; HCRTR1)
IC50
2868±n/a nM
Citation
 PubChem, PC Fluorescence-based cell-based high throughput dose response assay for antagonists of the orexin 1 receptor (OX1R; HCRTR1) PubChem Bioassay (2011)[AID] 
Target
Name:
Orexin/Hypocretin receptor type 1
Synonyms:
HCRTR1 OX1R_HUMAN Orexin receptor type 1 (OR 1) Orexin receptor type 1 (OX1) Orexin receptor type 1 (OxR1) | Ox1r
Type:
Protein
Mol. Mass.:
47554.50
Organism:
Homo sapiens (Human)
Description:
O43613
Residue:
425
  
Inhibitor
Name:
BDBM79926
Synonyms:
MLS000912821 N-[2-(4-chlorophenyl)ethyl]-2-[(3,5-dimethyl-1,2-oxazol-4-yl)sulfonyl-(4-methylphenyl)amino]ethanamide N-[2-(4-chlorophenyl)ethyl]-2-[N-[(3,5-dimethyl-4-isoxazolyl)sulfonyl]-4-methylanilino]acetamide cid_15990985
Type:
Small organic molecule
Emp. Form.:
C22H24ClN3O4S
Mol. Mass.:
461.962
SMILES:
Cc1noc(C)c1S(=O)(=O)N(CC(=O)NCCc1ccc(Cl)cc1)c1ccc(C)cc1
: