Target
Orexin/Hypocretin receptor type 1
Ligand
BDBM61750
Substrate
Meas. Tech.
Homogeneous Time Resolved Fluorescence (HTRF)-based cell-based high throughput dose response assay for antagonists of the orexin 1 receptor (OX1R; HCRTR1)
IC50
314.08±n/a nM
Citation
 PubChem, PC Homogeneous Time Resolved Fluorescence (HTRF)-based cell-based high throughput dose response assay for antagonists of the orexin 1 receptor (OX1R; HCRTR1) PubChem Bioassay (2011)[AID] 
Target
Name:
Orexin/Hypocretin receptor type 1
Synonyms:
HCRTR1 OX1R_HUMAN Orexin receptor type 1 (OR 1) Orexin receptor type 1 (OX1) Orexin receptor type 1 (OxR1) | Ox1r
Type:
Protein
Mol. Mass.:
47554.50
Organism:
Homo sapiens (Human)
Description:
O43613
Residue:
425
  
Inhibitor
Name:
BDBM61750
Synonyms:
2-[(2E)-2-(3-bromobenzylidene)-3-keto-1,4-benzoxazin-4-yl]-N-(tetrahydrofurfuryl)acetamide 2-[(2E)-2-[(3-bromophenyl)methylidene]-3-oxo-1,4-benzoxazin-4-yl]-N-(2-oxolanylmethyl)acetamide MLS001030850 cid_24789943
Type:
Small organic molecule
Emp. Form.:
C22H21BrN2O4
Mol. Mass.:
457.317
SMILES:
Brc1cccc(\C=C2\Oc3ccccc3N(CC(=O)NCC3CCCO3)C2=O)c1
: