Target
Orexin/Hypocretin receptor type 1
Ligand
BDBM79942
Substrate
Meas. Tech.
Homogeneous Time Resolved Fluorescence (HTRF)-based cell-based high throughput dose response assay for antagonists of the orexin 1 receptor (OX1R; HCRTR1)
IC50
174.8±n/a nM
Citation
 PubChem, PC Homogeneous Time Resolved Fluorescence (HTRF)-based cell-based high throughput dose response assay for antagonists of the orexin 1 receptor (OX1R; HCRTR1) PubChem Bioassay (2011)[AID] 
Target
Name:
Orexin/Hypocretin receptor type 1
Synonyms:
HCRTR1 OX1R_HUMAN Orexin receptor type 1 (OR 1) Orexin receptor type 1 (OX1) Orexin receptor type 1 (OxR1) | Ox1r
Type:
Protein
Mol. Mass.:
47554.50
Organism:
Homo sapiens (Human)
Description:
O43613
Residue:
425
  
Inhibitor
Name:
BDBM79942
Synonyms:
MLS001072368 [3-(3,4-dimethylanilino)-1-piperidinyl]-[3-(1H-imidazol-2-yl)phenyl]methanone [3-(3,4-dimethylanilino)piperidino]-[3-(1H-imidazol-2-yl)phenyl]methanone cid_24819406
Type:
Small organic molecule
Emp. Form.:
C23H26N4O
Mol. Mass.:
374.4787
SMILES:
Cc1ccc(NC2CCCN(C2)C(=O)c2cccc(c2)-c2ncc[nH]2)cc1C
: