Target
Beta-galactosidase
Ligand
BDBM56999
Substrate
Meas. Tech.
HTS Dose response counterscreen for assays utilizing the enzyme, beta-galactosidase - Set 3
IC50
>66600±0 nM
Citation
 PubChem, PC HTS Dose response counterscreen for assays utilizing the enzyme, beta-galactosidase - Set 3 PubChem Bioassay (2011)[AID] 
Target
Name:
Beta-galactosidase
Synonyms:
BGAL_ECOLX Lactase | lacZ
Type:
PROTEIN
Mol. Mass.:
116943.87
Organism:
Escherichia coli
Description:
ChEMBL_215882
Residue:
1029
  
Inhibitor
Name:
BDBM56999
Synonyms:
(4-fluoro-1,3-benzothiazol-2-yl)-[5-(2-furyl)-1,3,4-oxadiazol-2-yl]amine MLS000045464 N-(4-fluoro-1,3-benzothiazol-2-yl)-5-(2-furanyl)-1,3,4-oxadiazol-2-amine SMR000027223 | cid_3245517
Type:
Small organic molecule
Emp. Form.:
C13H7FN4O2S
Mol. Mass.:
302.284
SMILES:
Fc1cccc2sc(Nc3nnc(o3)-c3ccco3)nc12
: