Target
Beta-galactosidase
Ligand
BDBM43966
Substrate
Meas. Tech.
HTS Dose response counterscreen for assays utilizing the enzyme, beta-galactosidase - Set 3
IC50
>66600±0 nM
Citation
 PubChem, PC HTS Dose response counterscreen for assays utilizing the enzyme, beta-galactosidase - Set 3 PubChem Bioassay (2011)[AID] 
Target
Name:
Beta-galactosidase
Synonyms:
BGAL_ECOLX Lactase | lacZ
Type:
PROTEIN
Mol. Mass.:
116943.87
Organism:
Escherichia coli
Description:
ChEMBL_215882
Residue:
1029
  
Inhibitor
Name:
BDBM43966
Synonyms:
1-(1H-benzimidazol-2-yl)-3-methyl-4-phenyl-1H-pyrazol-5-amine 2-(1H-benzimidazol-2-yl)-5-methyl-4-phenyl-pyrazol-3-amine MLS000063763 [2-(1H-benzimidazol-2-yl)-5-methyl-4-phenyl-pyrazol-3-yl]amine | cid_718748
Type:
Small organic molecule
Emp. Form.:
C17H15N5
Mol. Mass.:
289.3345
SMILES:
Cc1nn(c(N)c1-c1ccccc1)-c1nc2ccccc2[nH]1
: