Target
Beta-galactosidase
Ligand
BDBM64660
Substrate
Meas. Tech.
HTS Dose response counterscreen for assays utilizing the enzyme, beta-galactosidase - Set 3
IC50
>66600±0 nM
Citation
 PubChem, PC HTS Dose response counterscreen for assays utilizing the enzyme, beta-galactosidase - Set 3 PubChem Bioassay (2011)[AID] 
Target
Name:
Beta-galactosidase
Synonyms:
BGAL_ECOLX Lactase | lacZ
Type:
PROTEIN
Mol. Mass.:
116943.87
Organism:
Escherichia coli
Description:
ChEMBL_215882
Residue:
1029
  
Inhibitor
Name:
BDBM64660
Synonyms:
MLS000705485 N-[(8-hydroxy-5-nitro-7-quinolinyl)-(4-methylphenyl)methyl]acetamide N-[(8-hydroxy-5-nitroquinolin-7-yl)-(4-methylphenyl)methyl]acetamide SMR000230818 | cid_4139598
Type:
Small organic molecule
Emp. Form.:
C19H17N3O4
Mol. Mass.:
351.356
SMILES:
CC(=O)NC(c1ccc(C)cc1)c1cc([N+]([O-])=O)c2cccnc2c1O
: