Target
Beta-galactosidase
Ligand
BDBM46960
Substrate
Meas. Tech.
HTS Dose response counterscreen for assays utilizing the enzyme, beta-galactosidase - Set 3
IC50
>66600±0 nM
Citation
 PubChem, PC HTS Dose response counterscreen for assays utilizing the enzyme, beta-galactosidase - Set 3 PubChem Bioassay (2011)[AID] 
Target
Name:
Beta-galactosidase
Synonyms:
BGAL_ECOLX Lactase | lacZ
Type:
PROTEIN
Mol. Mass.:
116943.87
Organism:
Escherichia coli
Description:
ChEMBL_215882
Residue:
1029
  
Inhibitor
Name:
BDBM46960
Synonyms:
2-azanylidene-3-[5-[(2-chlorophenyl)methyl]-1,3-thiazol-2-yl]-1,3-thiazolidin-4-one 3-[5-[(2-chlorophenyl)methyl]-1,3-thiazol-2-yl]-2-imino-1,3-thiazolidin-4-one MLS000707890 cid_3157014
Type:
Small organic molecule
Emp. Form.:
C13H10ClN3OS2
Mol. Mass.:
323.821
SMILES:
Clc1ccccc1Cc1cnc(s1)N1C(=N)SCC1=O
: