Target
DNA dC->dU-editing enzyme APOBEC-3G
Ligand
BDBM80143
Substrate
Meas. Tech.
Dose Response confirmation of small molecule APOBEC3G DNA Deaminase Inhibitors via a fluorescence-based single-stranded DNA deaminase assay
Temperature
298.15±n/a K
IC50
1840±n/a nM
Comments
extracted
Citation
 PubChem, PC Dose Response confirmation of small molecule APOBEC3G DNA Deaminase Inhibitors via a fluorescence-based single-stranded DNA deaminase assay PubChem Bioassay (2011)[AID] 
Target
Name:
DNA dC->dU-editing enzyme APOBEC-3G
Synonyms:
ABC3G_HUMAN | APOBEC3G
Type:
Enzyme Catalytic Domain
Mol. Mass.:
46419.54
Organism:
Homo sapiens (Human)
Description:
gi_13399304
Residue:
384
  
Inhibitor
Name:
BDBM80143
Synonyms:
4-methyl-3-[1-methyl-3-(trifluoromethyl)-5-thieno[2,3-c]pyrazolyl]-1H-1,2,4-triazole-5-thione 4-methyl-5-[1-methyl-3-(trifluoromethyl)-1H-thieno[2,3-c]pyrazol-5-yl]-4H-1,2,4-triazole-3-thiol SMR000179140 | cid_2775440
Type:
Small organic molecule
Emp. Form.:
C10H8F3N5S2
Mol. Mass.:
319.329
SMILES:
Cn1nc(c2cc(sc12)-c1n[nH]c(=S)n1C)C(F)(F)F
: