Target
DNA dC->dU-editing enzyme APOBEC-3G
Ligand
BDBM80158
Substrate
Meas. Tech.
Dose Response confirmation of small molecule APOBEC3G DNA Deaminase Inhibitors via a fluorescence-based single-stranded DNA deaminase assay
Temperature
298.15±n/a K
IC50
2330±n/a nM
Comments
extracted
Citation
 PubChem, PC Dose Response confirmation of small molecule APOBEC3G DNA Deaminase Inhibitors via a fluorescence-based single-stranded DNA deaminase assay PubChem Bioassay (2011)[AID] 
Target
Name:
DNA dC->dU-editing enzyme APOBEC-3G
Synonyms:
ABC3G_HUMAN | APOBEC3G
Type:
Enzyme Catalytic Domain
Mol. Mass.:
46419.54
Organism:
Homo sapiens (Human)
Description:
gi_13399304
Residue:
384
  
Inhibitor
Name:
BDBM80158
Synonyms:
4-[(3-nitrobenzylidene)amino]-3-(3-pyridyl)-1H-1,2,4-triazole-5-thione 4-[(3-nitrophenyl)methylideneamino]-3-(3-pyridinyl)-1H-1,2,4-triazole-5-thione MLS000577310 cid_892666
Type:
Small organic molecule
Emp. Form.:
C14H10N6O2S
Mol. Mass.:
326.333
SMILES:
[O-][N+](=O)c1cccc([CH+][N-]n2c(n[nH]c2=S)-c2cccnc2)c1
: