Target
DNA dC->dU-editing enzyme APOBEC-3G
Ligand
BDBM80274
Substrate
Meas. Tech.
Dose Response confirmation of small molecule APOBEC3G DNA Deaminase Inhibitors via a fluorescence-based single-stranded DNA deaminase assay
Temperature
298.15±n/a K
IC50
2170±n/a nM
Comments
extracted
Citation
 PubChem, PC Dose Response confirmation of small molecule APOBEC3G DNA Deaminase Inhibitors via a fluorescence-based single-stranded DNA deaminase assay PubChem Bioassay (2011)[AID] 
Target
Name:
DNA dC->dU-editing enzyme APOBEC-3G
Synonyms:
ABC3G_HUMAN | APOBEC3G
Type:
Enzyme Catalytic Domain
Mol. Mass.:
46419.54
Organism:
Homo sapiens (Human)
Description:
gi_13399304
Residue:
384
  
Inhibitor
Name:
BDBM80274
Synonyms:
4-[(5-methyl-2-thienyl)methyleneamino]-3-(4-pyridyl)-1H-1,2,4-triazole-5-thione 4-[(5-methylthiophen-2-yl)methylideneamino]-3-pyridin-4-yl-1H-1,2,4-triazole-5-thione MLS000768195 cid_668513
Type:
Small organic molecule
Emp. Form.:
C13H11N5S2
Mol. Mass.:
301.39
SMILES:
Cc1ccc(C=Nn2c(n[nH]c2=S)-c2ccncc2)s1
: