Target
DNA dC->dU-editing enzyme APOBEC-3A
Ligand
BDBM80169
Substrate
Meas. Tech.
Dose Response confirmation of APOBEC3G DNA Deaminase Inhibitors via a A3A counterscreen
Temperature
298.15±n/a K
IC50
>100000±n/a nM
Comments
extracted
Citation
 PubChem, PC Dose Response confirmation of APOBEC3G DNA Deaminase Inhibitors via a A3A counterscreen PubChem Bioassay (2011)[AID] 
Target
Name:
DNA dC->dU-editing enzyme APOBEC-3A
Synonyms:
ABC3A_HUMAN probable DNA dC->dU-editing enzyme APOBEC-3A
Type:
Enzyme Catalytic Domain
Mol. Mass.:
23013.77
Organism:
Homo sapiens (Human)
Description:
gi_21955158
Residue:
199
  
Inhibitor
Name:
BDBM80169
Synonyms:
3-(2-furanyl)-4-[(5-methyl-2-thiophenyl)methylideneamino]-1H-1,2,4-triazole-5-thione 3-(furan-2-yl)-4-[(5-methylthiophen-2-yl)methylideneamino]-1H-1,2,4-triazole-5-thione MLS000590854 cid_668578
Type:
Small organic molecule
Emp. Form.:
C12H10N4OS2
Mol. Mass.:
290.364
SMILES:
Cc1ccc(C=Nn2c(n[nH]c2=S)-c2ccco2)s1
: