Target
DNA dC->dU-editing enzyme APOBEC-3A
Ligand
BDBM45603
Substrate
Meas. Tech.
Dose Response confirmation of APOBEC3G DNA Deaminase Inhibitors via a A3A counterscreen
Temperature
298.15±n/a K
IC50
26700±n/a nM
Comments
extracted
Citation
 PubChem, PC Dose Response confirmation of APOBEC3G DNA Deaminase Inhibitors via a A3A counterscreen PubChem Bioassay (2011)[AID] 
Target
Name:
DNA dC->dU-editing enzyme APOBEC-3A
Synonyms:
ABC3A_HUMAN probable DNA dC->dU-editing enzyme APOBEC-3A
Type:
Enzyme Catalytic Domain
Mol. Mass.:
23013.77
Organism:
Homo sapiens (Human)
Description:
gi_21955158
Residue:
199
  
Inhibitor
Name:
BDBM45603
Synonyms:
4-[[(E)-3-(2-furanyl)prop-2-enylidene]amino]-3-pyridin-4-yl-1H-1,2,4-triazole-5-thione 4-[[(E)-3-(furan-2-yl)prop-2-enylidene]amino]-3-pyridin-4-yl-1H-1,2,4-triazole-5-thione MLS000677563 cid_1600860
Type:
Small organic molecule
Emp. Form.:
C14H11N5OS
Mol. Mass.:
297.335
SMILES:
S=c1[nH]nc(-c2ccncc2)n1N=CC=Cc1ccco1
: