Target
DNA dC->dU-editing enzyme APOBEC-3A
Ligand
BDBM80264
Substrate
Meas. Tech.
Dose Response confirmation of APOBEC3G DNA Deaminase Inhibitors via a A3A counterscreen
Temperature
298.15±n/a K
IC50
>100000±n/a nM
Comments
extracted
Citation
 PubChem, PC Dose Response confirmation of APOBEC3G DNA Deaminase Inhibitors via a A3A counterscreen PubChem Bioassay (2011)[AID] 
Target
Name:
DNA dC->dU-editing enzyme APOBEC-3A
Synonyms:
ABC3A_HUMAN probable DNA dC->dU-editing enzyme APOBEC-3A
Type:
Enzyme Catalytic Domain
Mol. Mass.:
23013.77
Organism:
Homo sapiens (Human)
Description:
gi_21955158
Residue:
199
  
Inhibitor
Name:
BDBM80264
Synonyms:
4-(m-anisylideneamino)-3-(5-methyl-1H-pyrazol-3-yl)-1H-1,2,4-triazole-5-thione 4-{[1-(3-Methoxy-phenyl)-meth-(E)-ylidene]-amino}-5-(5-methyl-2H-pyrazol-3-yl)-4H-[1,2,4]triazole-3-thio l SMR000438114 | cid_1627237
Type:
Small organic molecule
Emp. Form.:
C14H14N6OS
Mol. Mass.:
314.366
SMILES:
COc1cccc(C=Nn2c(n[nH]c2=S)-c2cc(C)[nH]n2)c1
: