Target
DNA dC->dU-editing enzyme APOBEC-3G
Ligand
BDBM37537
Substrate
Meas. Tech.
Dose Response confirmation of APOBEC3A DNA Deaminase Inhibitors via a A3G counterscreen
Temperature
298.15±n/a K
IC50
1950±197 nM
Comments
extracted
Citation
 PubChem, PC Dose Response confirmation of APOBEC3A DNA Deaminase Inhibitors via a A3G counterscreen PubChem Bioassay (2011)[AID] 
Target
Name:
DNA dC->dU-editing enzyme APOBEC-3G
Synonyms:
ABC3G_HUMAN | APOBEC3G
Type:
Enzyme Catalytic Domain
Mol. Mass.:
46419.54
Organism:
Homo sapiens (Human)
Description:
gi_13399304
Residue:
384
  
Inhibitor
Name:
BDBM37537
Synonyms:
2-(2-imidazolin-2-ylamino)ethanol;hydroiodide MLS000071441 cid_6603060
Type:
Small organic molecule
Emp. Form.:
C5H11N3O
Mol. Mass.:
129.1603
SMILES:
OCCNC1=NCCN1
: