Target
DNA dC->dU-editing enzyme APOBEC-3G
Ligand
BDBM40679
Substrate
Meas. Tech.
Dose Response confirmation of APOBEC3A DNA Deaminase Inhibitors via a A3G counterscreen
Temperature
298.15±n/a K
IC50
1320±101 nM
Comments
extracted
Citation
 PubChem, PC Dose Response confirmation of APOBEC3A DNA Deaminase Inhibitors via a A3G counterscreen PubChem Bioassay (2011)[AID] 
Target
Name:
DNA dC->dU-editing enzyme APOBEC-3G
Synonyms:
ABC3G_HUMAN | APOBEC3G
Type:
Enzyme Catalytic Domain
Mol. Mass.:
46419.54
Organism:
Homo sapiens (Human)
Description:
gi_13399304
Residue:
384
  
Inhibitor
Name:
BDBM40679
Synonyms:
1-ethyl-2,6-dimethyl-3,4-dihydropyrrolo[1,2-a]pyrazin-2-ium iodide MLS000532590 cid_2826925
Type:
Small organic molecule
Emp. Form.:
C11H17N2
Mol. Mass.:
177.2655
SMILES:
CCC1=[N+](C)CCn2c(C)ccc12
: